... fails to build with the following error : ld: framework not found Mapbox clang: error: linker command failed with exit code 1 (use -v to see invocation). xCode is.... Mar 4, 2021 Bitrise Build Issue Report template Description of the issue Please describe the issue here Environment: Where did the issue happen?. Oct 2, 2020 /project/path/platforms/ios/internal/NativeScript.framework/NativeScript' for architecture arm64 clang: error: linker command failed with exit code.... Jan 31, 2019 my was getting problem and stuck in splash screen after that I open the console in xcode and getting an error that I have to upgrade my.... Sep 27, 2011 If you work with Xcode code signing long enough you'll run into an error like this: /usr/bin/codesign failed with exit code 1 If you view the build.... xcode linker command failed with exit code 1 (use -v to see invocation) ... The linker error is generally the wrong library, no implementation of the interface, or the.... Specific Error Messages Error Message: If you see a Cartfile failure and several other red errors ... Solution: Make sure to download a fresh version of code! ... select your Xcode version (the figure shows 12.0.1 - yours should.... Jun 8, 2020 No Xcode scheme is found My iOS builds fail with "clang: error: linker command failed with exit code 1" iOS signing issues explained Where's.... node-gyp Error: `gyp` failed with exit code: 1 (macOS | NPM) ... To see if Xcode Command Line Tools is installed in a way that will work with node-gyp , run: curl -sL ... useState is one of build-in react hooks available in 16.7 version. useState.... May 1, 2017 Some of you might even have seen it while using Xcode itself but weren't aware since Xcode hides those error codes from you. In order to prevent.... Mar 4, 2021 Hi there, I got the 'code sign error' when I compile my code. ... openframeworks 0.11.1 with macOS Catalina version 10.15.7 and Xcode 11.6.. Complete the following steps to resolve this issue: Go to Xcode > Preferences > Downloads, and install Command Line Tools. Run the CGAppPrepTool again.. http://bit.ly/oQ5qKo Tips for solving the xcode codesign failed with exit code 1 certificate error. How to find .... Nov 3, 2017 Code sign Error -Command /usr/bin/codesign failed with exit code 1 ... 11:22:52.904 xcodebuild[15103:868504] Beginning test session... 67426dafae

{SapR3ゃ祉潟鴻吾с若吾с若帥V20},Grim Nights-Elven Cursezip≧潟若,kamarmandi sarah azhari femmy permatasari ziddu 12

コメントをかく


「http://」を含む投稿は禁止されています。

利用規約をご確認のうえご記入下さい

Menu

メニューサンプル1

メニューサンプル2

開くメニュー

閉じるメニュー

  • アイテム
  • アイテム
  • アイテム
【メニュー編集】

メンバーのみ編集できます